Target
Alpha-2A adrenergic receptor
Ligand
BDBM50055830
Substrate
Meas. Tech.
ChEMBL_33066 (CHEMBL647965)
Ki
6±n/a nM
Citation
 Munk, SAHarcourt, DAArasasingham, PNBurke, JAKharlamb, ABManlapaz, CAPadillo, EURoberts, DRunde, EWilliams, LWheeler, LAGarst, ME Synthesis and evaluation of 2-(arylamino)imidazoles as alpha 2-adrenergic agonists. J Med Chem 40:18-23 (1997)  
Target
Name:
Alpha-2A adrenergic receptor
Synonyms:
ADA2A_HUMAN ADRA2R Adrenergic alpha2A Alpha-2 adrenergic receptor subtype C10 Alpha-2A adrenoreceptor alpha-2A adrenergic receptor [Homo sapiens]
Type:
Enzyme
Mol. Mass.:
48979.91
Organism:
Homo sapiens (Human)
Description:
P08913
Residue:
450
  
Inhibitor
Name:
BDBM50055830
Synonyms:
(1H-Imidazol-2-yl)-(5-methyl-3,4-dihydro-2H-benzo[1,4]oxazin-6-yl)-amine | CHEMBL432155
Type:
Small organic molecule
Emp. Form.:
C12H14N4O
Mol. Mass.:
230.2658
SMILES:
Cc1c(Nc2ncc[nH]2)ccc2OCCNc12
: