Target
M17 leucyl aminopeptidase
Ligand
BDBM50190111
Substrate
Meas. Tech.
ChEMBL_1821471 (CHEMBL4321131)
Ki
13±n/a nM
Citation
 Talma, MMa?lanka, MMucha, A Recent developments in the synthesis and applications of phosphinic peptide analogs. Bioorg Med Chem Lett 29:1031-1042 (2019)  
Target
Name:
M17 leucyl aminopeptidase
Synonyms:
leucine aminopeptidase
Type:
Enzyme Catalytic Domain
Mol. Mass.:
67834.32
Organism:
Plasmodium falciparum 3D7
Description:
gi_124809582
Residue:
605
  
Inhibitor
Name:
BDBM50190111
Synonyms:
CHEMBL327844
Type:
Small organic molecule
Emp. Form.:
C19H24NO4P
Mol. Mass.:
361.3719
SMILES:
NC(CCc1ccccc1)P(O)(=O)CC(Cc1ccccc1)C(O)=O
: