Target
M17 leucyl aminopeptidase
Ligand
BDBM50190112
Substrate
Meas. Tech.
ChEMBL_1821471 (CHEMBL4321131)
Ki
10.0±n/a nM
Citation
 Talma, MMa?lanka, MMucha, A Recent developments in the synthesis and applications of phosphinic peptide analogs. Bioorg Med Chem Lett 29:1031-1042 (2019)  
Target
Name:
M17 leucyl aminopeptidase
Synonyms:
leucine aminopeptidase
Type:
Enzyme Catalytic Domain
Mol. Mass.:
67834.32
Organism:
Plasmodium falciparum 3D7
Description:
gi_124809582
Residue:
605
  
Inhibitor
Name:
BDBM50190112
Synonyms:
CHEMBL88808
Type:
Small organic molecule
Emp. Form.:
C19H24NO5P
Mol. Mass.:
377.3713
SMILES:
NC(CCc1ccccc1)P(O)(=O)CC(Cc1ccc(O)cc1)C(O)=O
: