Target
Aldo-keto reductase family 1 member A1
Ligand
BDBM50056536
Substrate
Meas. Tech.
ChEMBL_31321 (CHEMBL644874)
IC50
>100000±n/a nM
Citation
 Kotani, TNagaki, YIshii, AKonishi, YYago, HSuehiro, SOkukado, NOkamoto, K Highly selective aldose reductase inhibitors. 3. Structural diversity of 3-(arylmethyl)-2,4,5-trioxoimidazolidine-1-acetic acids. J Med Chem 40:684-94 (1997)  
Target
Name:
Aldo-keto reductase family 1 member A1
Synonyms:
AK1A1_RAT Aldehyde reductase | Alr
Type:
PROTEIN
Mol. Mass.:
36509.97
Organism:
Rattus norvegicus
Description:
ChEMBL_31321
Residue:
325
  
Inhibitor
Name:
BDBM50056536
Synonyms:
CHEMBL159750 | [3-(3-Nitro-benzyl)-2,5-dioxo-imidazolidin-1-yl]-acetic acid
Type:
Small organic molecule
Emp. Form.:
C12H11N3O6
Mol. Mass.:
293.2322
SMILES:
OC(=O)Cn1c(O)cn(Cc2cccc(c2)[N+]([O-])=O)c1=O
: