Target
Aldo-keto reductase family 1 member A1
Ligand
BDBM50056541
Substrate
Meas. Tech.
ChEMBL_31321 (CHEMBL644874)
IC50
>100000±n/a nM
Citation
 Kotani, TNagaki, YIshii, AKonishi, YYago, HSuehiro, SOkukado, NOkamoto, K Highly selective aldose reductase inhibitors. 3. Structural diversity of 3-(arylmethyl)-2,4,5-trioxoimidazolidine-1-acetic acids. J Med Chem 40:684-94 (1997)  
Target
Name:
Aldo-keto reductase family 1 member A1
Synonyms:
AK1A1_RAT Aldehyde reductase | Alr
Type:
PROTEIN
Mol. Mass.:
36509.97
Organism:
Rattus norvegicus
Description:
ChEMBL_31321
Residue:
325
  
Inhibitor
Name:
BDBM50056541
Synonyms:
CHEMBL159288 | [2-Methylene-3-(3-nitro-benzyl)-4,5-dioxo-imidazolidin-1-yl]-acetic acid
Type:
Small organic molecule
Emp. Form.:
C13H11N3O6
Mol. Mass.:
305.2429
SMILES:
OC(=O)CN1C(=C)N(Cc2cccc(c2)[N+]([O-])=O)C(=O)C1=O
: