Target
Potassium channel subfamily K member 9
Ligand
BDBM22876
Substrate
Meas. Tech.
ChEMBL_1822397 (CHEMBL4322161)
IC50
63400±n/a nM
Citation
 Bedoya, MRinné, SKiper, AKDecher, NGonzález, WRamírez, D TASK Channels Pharmacology: New Challenges in Drug Design. J Med Chem 62:10044-10058 (2019)  
Target
Name:
Potassium channel subfamily K member 9
Synonyms:
Acid-sensitive potassium channel protein TASK-3 KCNK9_HUMAN TWIK-related acid-sensitive K(+) channel 3 Two pore potassium channel KT3.2
Type:
PROTEIN
Mol. Mass.:
42276.04
Organism:
Homo sapiens (Human)
Description:
ChEMBL_1457494
Residue:
374
  
Inhibitor
Name:
BDBM22876
Synonyms:
CHEMBL998 Loratadine US9138431, LORATADINE (Claritin) ethyl 4-{13-chloro-4-azatricyclo[9.4.0.0^{3,8}]pentadeca-1(11),3(8),4,6,12,14-hexaen-2-ylidene}piperidine-1-carboxylate
Type:
Small organic molecule
Emp. Form.:
C22H23ClN2O2
Mol. Mass.:
382.883
SMILES:
[#6]-[#6]-[#8]-[#6](=O)-[#7]-1-[#6]-[#6]\[#6](-[#6]-[#6]-1)=[#6]-1\c2ccc(Cl)cc2-[#6]-[#6]-c2cccnc-12
: