Target
Lanosterol 14-alpha demethylase
Ligand
BDBM50505759
Substrate
Meas. Tech.
ChEMBL_1823978 (CHEMBL4323742)
IC50
3000±n/a nM
Citation
 Friggeri, LHargrove, TYWawrzak, ZGuengerich, FPLepesheva, GI Validation of Human Sterol 14?-Demethylase (CYP51) Druggability: Structure-Guided Design, Synthesis, and Evaluation of Stoichiometric, Functionally Irreversible Inhibitors. J Med Chem 62:10391-10401 (2019)  
Target
Name:
Lanosterol 14-alpha demethylase
Synonyms:
CP51A_HUMAN CYP51A1 Cytochrome P450 51 LDM P450-14DM P450LI Sterol 14-alpha demethylase
Type:
Protein
Mol. Mass.:
56817.21
Organism:
Homo sapiens (Human)
Description:
Q16850
Residue:
503
  
Inhibitor
Name:
BDBM50505759
Synonyms:
CHEMBL4593688
Type:
Small organic molecule
Emp. Form.:
C36H26FN5O2
Mol. Mass.:
579.6223
SMILES:
Fc1ccc(cc1)-c1ccc([C@H](Cn2ccnc2)NC(=O)c2ccc(cc2)-c2nnc(o2)-c2ccccc2)c2ccccc12
: