Target
Ribosomal protein S6 kinase alpha-6
Ligand
BDBM50505870
Substrate
Meas. Tech.
ChEMBL_1824427 (CHEMBL4324191)
IC50
>20000±n/a nM
Citation
 Röhm, SBerger, BTSchröder, MChaikuad, AWinkel, RHekking, KFWBenningshof, JJCMüller, GTesch, RKudolo, MForster, MLaufer, SKnapp, S Fast Iterative Synthetic Approach toward Identification of Novel Highly Selective p38 MAP Kinase Inhibitors. J Med Chem 62:10757-10782 (2019)  
Target
Name:
Ribosomal protein S6 kinase alpha-6
Synonyms:
90 kDa ribosomal protein S6 kinase 6 RPS6KA6 RPS6KA6(Kin.Dom.2 - C-terminal) RSK4 Ribosomal S6 kinase 4 Ribosomal protein S6 kinase alpha 6 (RSK4) S6K-alpha 6 p90RSK | pp90RSK4
Type:
Serine/threonine-protein kinase
Mol. Mass.:
83868.06
Organism:
Homo sapiens (Human)
Description:
Residue:
745
  
Inhibitor
Name:
BDBM50505870
Synonyms:
CHEMBL4531775
Type:
Small organic molecule
Emp. Form.:
C28H31F3N4O2
Mol. Mass.:
512.5665
SMILES:
FC(F)(F)c1c(cnn1-c1ccccc1)C(=O)NCc1ccc(cc1)C(=O)NCCCC1CCCCC1
: