Target
Nonstructural protein 5A
Ligand
BDBM50505965
Substrate
Meas. Tech.
ChEMBL_1824512 (CHEMBL4324276)
IC50
0.009±n/a nM
Citation
 Ramdas, VTalwar, RBanerjee, MJoshi, AADas, AKWalke, DSBorhade, PDhayagude, ULoriya, RGote, GBommakanti, ASivaram, AAgarwal, GGoswami, ANigade, PMehta, MPatil, VModi, DKumar, HMallurwar, SDash, AModi, FKuldharan, SSrivastava, PSingh, MNarasimham, LGundu, JSharma, SKamboj, RKPalle, VP Discovery and Characterization of Potent Pan-Genotypic HCV NS5A Inhibitors Containing Novel Tricyclic Central Core Leading to Clinical Candidate. J Med Chem 62:10563-10582 (2019)  
Target
Name:
Nonstructural protein 5A
Synonyms:
NS5A | Nonstructural protein 5A
Type:
PROTEIN
Mol. Mass.:
48587.20
Organism:
Hepatitis C virus
Description:
ChEMBL_108438
Residue:
447
  
Inhibitor
Name:
BDBM50505965
Synonyms:
CHEMBL4574210
Type:
Small organic molecule
Emp. Form.:
C39H48N8O7S
Mol. Mass.:
772.913
SMILES:
COC(=O)N[C@@H](C(C)C)C(=O)N1CCC[C@H]1c1ncc([nH]1)-c1cc2COc3cc(ccc3-c2s1)-c1cnc([nH]1)[C@@H]1CCCN1C(=O)[C@@H](NC(=O)OC)C(C)C
: