Target
Cell division cycle 7-related protein kinase
Ligand
BDBM50253706
Substrate
Meas. Tech.
ChEMBL_1825599 (CHEMBL4325363)
Kd
0.541±n/a nM
Citation
 Kurasawa, OMiyazaki, THomma, MOguro, YImada, TUchiyama, NIwai, KYamamoto, YOhori, MHara, HSugimoto, HIwata, KSkene, RHoffman, IOhashi, ANomura, TCho, N Discovery of a Novel, Highly Potent, and Selective Thieno[3,2- J Med Chem 63:1084-1104 (2020)  
Target
Name:
Cell division cycle 7-related protein kinase
Synonyms:
CDC7 CDC7L1 Cell division cycle 7-related protein kinase (CDC7) huCdc7
Type:
Protein
Mol. Mass.:
63908.16
Organism:
Homo sapiens (Human)
Description:
O00311
Residue:
574
  
Inhibitor
Name:
BDBM50253706
Synonyms:
CHEMBL4083927
Type:
Small organic molecule
Emp. Form.:
C15H17N5OS
Mol. Mass.:
315.393
SMILES:
Cc1n[nH]cc1-c1cc2nc(CN3CCCC3)[nH]c(=O)c2s1
: