Target
Polymerase acidic protein
Ligand
BDBM50216627
Substrate
Meas. Tech.
ChEMBL_1828968 (CHEMBL4328842)
IC50
11000±n/a nM
Citation
 Dar'in, DZarubaev, VGalochkina, AGureev, MKrasavin, M Non-chelating p-phenylidene-linked bis-imidazoline analogs of known influenza virus endonuclease inhibitors: Synthesis and anti-influenza activity. Eur J Med Chem 161:526-532 (2019)  
Target
Name:
Polymerase acidic protein
Synonyms:
Hepatitis C virus polyprotein PA/PB1 Polymerase acidic protein | RNA-directed RNA polymerase subunit P2
Type:
PROTEIN
Mol. Mass.:
82573.84
Organism:
Hepatitis C virus
Description:
ChEMBL_64976
Residue:
716
  
Inhibitor
Name:
BDBM50216627
Synonyms:
(alpha-methyl-1-adamantyl)methylamine CHEMBL959 US11241393, Rimantadine rimantidin
Type:
Small organic molecule
Emp. Form.:
C12H21N
Mol. Mass.:
179.3018
SMILES:
CC(N)C12CC3CC(CC(C3)C1)C2
: