Target
Tyrosyl-DNA phosphodiesterase 1
Ligand
BDBM11995
Substrate
Meas. Tech.
ChEMBL_1829127 (CHEMBL4329001)
IC50
110±n/a nM
Citation
 Zakharenko, ALLuzina, OASokolov, DNKaledin, VINikolin, VPPopova, NAPatel, JZakharova, ODChepanova, AAZafar, AReynisson, JLeung, ELeung, IKHVolcho, KPSalakhutdinov, NFLavrik, OI Novel tyrosyl-DNA phosphodiesterase 1 inhibitors enhance the therapeutic impact of topote?an on in vivo tumor models. Eur J Med Chem 161:581-593 (2019)  
Target
Name:
Tyrosyl-DNA phosphodiesterase 1
Synonyms:
TDP1 Tyrosyl-DNA phosphodiesterase 1 | Tyrosyl-DNA phosphodiesterase 1 (TDP1)
Type:
Enzyme
Mol. Mass.:
68430.66
Organism:
Homo sapiens (Human)
Description:
Q9NUW8
Residue:
608
  
Inhibitor
Name:
BDBM11995
Synonyms:
2-chloro-5-(2,5-dimethyl-1H-pyrrol-1-yl)benzoic acid | Interchim compound 57
Type:
Small organic molecule
Emp. Form.:
C13H12ClNO2
Mol. Mass.:
249.693
SMILES:
Cc1ccc(C)n1-c1ccc(Cl)c(c1)C(O)=O
: