Target
Tyrosyl-DNA phosphodiesterase 1
Ligand
BDBM81347
Substrate
Meas. Tech.
ChEMBL_1829128 (CHEMBL4329002)
IC50
360±n/a nM
Citation
 Zakharenko, ALLuzina, OASokolov, DNKaledin, VINikolin, VPPopova, NAPatel, JZakharova, ODChepanova, AAZafar, AReynisson, JLeung, ELeung, IKHVolcho, KPSalakhutdinov, NFLavrik, OI Novel tyrosyl-DNA phosphodiesterase 1 inhibitors enhance the therapeutic impact of topote?an on in vivo tumor models. Eur J Med Chem 161:581-593 (2019)  
Target
Name:
Tyrosyl-DNA phosphodiesterase 1
Synonyms:
TDP1 Tyrosyl-DNA phosphodiesterase 1 | Tyrosyl-DNA phosphodiesterase 1 (TDP1)
Type:
Enzyme
Mol. Mass.:
68430.66
Organism:
Homo sapiens (Human)
Description:
Q9NUW8
Residue:
608
  
Inhibitor
Name:
BDBM81347
Synonyms:
L2037 (beta-lapachone)
Type:
Small organic molecule
Emp. Form.:
C7H8N2O3
Mol. Mass.:
168.15
SMILES:
CN(N=O)c1ccc(O)c(O)c1
: