Target
Myeloperoxidase
Ligand
BDBM50507391
Substrate
Meas. Tech.
ChEMBL_1829870 (CHEMBL4329744)
IC50
8.5±n/a nM
Citation
 Wurtz, NRViet, AShaw, SADilger, AValente, MNKhan, JAJusuf, SNarayanan, RFernando, GLo, FLiu, XLocke, GAKopcho, LAbell, LMSleph, PBasso, MZhao, LWexler, RRDuclos, FKick, EK Potent Triazolopyridine Myeloperoxidase Inhibitors. ACS Med Chem Lett 9:1175-1180 (2018)  
Target
Name:
Myeloperoxidase
Synonyms:
84 kDa myeloperoxidase MPO Myeloperoxidase Myeloperoxidase heavy chain PERM_HUMAN
Type:
Enzyme
Mol. Mass.:
83888.32
Organism:
Homo sapiens (Human)
Description:
P05164
Residue:
745
  
Inhibitor
Name:
BDBM50507391
Synonyms:
CHEMBL4594116 | US10981879, Example 153
Type:
Small organic molecule
Emp. Form.:
C15H12F2N8S
Mol. Mass.:
374.371
SMILES:
Nc1cc(SCc2nn(nc2C(F)F)-c2ccccc2)c2nn[nH]c2n1
: