Target
High affinity nerve growth factor receptor
Ligand
BDBM50299148
Substrate
Meas. Tech.
ChEMBL_1830183 (CHEMBL4330191)
IC50
7.0±n/a nM
Citation
 Yan, WLakkaniga, NRCarlomagno, FSantoro, MMcDonald, NQLv, FGunaganti, NFrett, BLi, HY Insights into Current Tropomyosin Receptor Kinase (TRK) Inhibitors: Development and Clinical Application. J Med Chem 62:1731-1760 (2019)  
Target
Name:
High affinity nerve growth factor receptor
Synonyms:
2.7.10.1 NTRK1 NTRK1_HUMAN Neurotrophic tyrosine kinase receptor type 1 Synonyms=MTC TRK1-transforming tyrosine kinase protein TRKA GN Tropomyosin alpha-3 chain/High affinity nerve growth factor receptor Tropomyosin-related kinase A (TrkA) Tyrosine kinase receptor (Trk) Tyrosine kinase receptor A (Trk A) Tyrosine kinase receptor A (TrkA) p140-TrkA
Type:
Mol. Mass.:
87498.18
Organism:
Homo sapiens (Human)
Description:
P04629
Residue:
796
  
Inhibitor
Name:
BDBM50299148
Synonyms:
(S)-1-(4-(5-cyclopropyl-1H-pyrazol-3-ylamino)pyrrolo[1,2-f][1,2,4]triazin-2-yl)-N-(6-fluoropyridin-3-yl)-2-methylpyrrolidine-2-carboxamide BMS-754807 | CHEMBL575448
Type:
Small organic molecule
Emp. Form.:
C23H24FN9O
Mol. Mass.:
461.4948
SMILES:
C[C@]1(CCCN1c1nc(Nc2cc([nH]n2)C2CC2)c2cccn2n1)C(=O)Nc1ccc(F)nc1
: