Target
Alpha-1A adrenergic receptor
Ligand
BDBM50060964
Substrate
Meas. Tech.
ChEMBL_33607 (CHEMBL652814)
Ki
0.029±n/a nM
Citation
 Meyer, MDAltenbach, RJBasha, FZCarroll, WADrizin, IElmore, SWEhrlich, PPLebold, SATietje, KSippy, KBWendt, MDPlata, DJPlagge, FBuckner, SABrune, MEHancock, AAKerwin, JF Synthesis and pharmacological characterization of 3-[2-((3aR,9bR)-cis-6-methoxy-2,3,3a,4,5,9b-hexahydro-1H-benz[e] isoindol-2-yl)ethyl]pyrido-[3',4':4,5]thieno[3,2-d]pyrimidine-2,4 (1H,3H)-dione (A-131701): a uroselective alpha 1A adrenoceptor antagonist for the symptomatic treatment of benign pr J Med Chem 40:3141-3 (1997)  
Target
Name:
Alpha-1A adrenergic receptor
Synonyms:
ADA1A_HUMAN ADRA1C Alpha 1A-adrenoceptor Alpha adrenergic receptor 1a Alpha-adrenergic receptor 1c adrenergic Alpha1 | adrenergic Alpha1C
Type:
Cell-surface receptors
Mol. Mass.:
51511.67
Organism:
Homo sapiens (Human)
Description:
P35348
Residue:
466
  
Inhibitor
Name:
BDBM50060964
Synonyms:
(R)-5-(2-((2-(2-ethoxyphenoxy)ethyl)amino)propyl)-2-methoxybenzenesulfonamide 5-[2-[2-(2-ethoxyphenoxy)ethylamino]propyl]-2-methoxy-benzenesulfonamide TAMSULOSIN
Type:
Small organic molecule
Emp. Form.:
C20H28N2O5S
Mol. Mass.:
408.512
SMILES:
CCOc1ccccc1OCCN[C@H](C)Cc1ccc(OC)c(c1)S(N)(=O)=O
: