Target
6-phosphofructo-2-kinase/fructose-2,6-bisphosphatase 3
Ligand
BDBM50508556
Substrate
Meas. Tech.
ChEMBL_1833217 (CHEMBL4333225)
IC50
33±n/a nM
Citation
 Boutard, NBia?as, ASabiniarz, AGuzik, PBanaszak, KBiela, ABie?, MBuda, ABugaj, BCieluch, ECierpich, ADudek, ?Eggenweiler, HMFogt, JGaik, MGondela, AJakubiec, KJurzak, MKitli?ska, AKowalczyk, PKujawa, MKwieci?ska, KLe?, MLindemann, RMaciuszek, MMikulski, MNiedziejko, PObara, APawlik, HRzymski, TSieprawska-Lupa, MSowi?ska, MSzeremeta-Spisak, JStachowicz, ATomczyk, MMWiklik, KW?oszczak, ?Ziemia?ska, SZar?bski, ABrzózka, KNowak, MFabritius, CH Synthesis of amide and sulfonamide substituted N-aryl 6-aminoquinoxalines as PFKFB3 inhibitors with improved physicochemical properties. Bioorg Med Chem Lett 29:646-653 (2019)  
Target
Name:
6-phosphofructo-2-kinase/fructose-2,6-bisphosphatase 3
Synonyms:
6-phosphofructo-2-kinase 6-phosphofructo-2-kinase/fructose-2,6-bisphosphatase 3 (PFKFB3) 6PF-2-K/Fru-2,6-P2ase brain/placenta-type isozyme Fructose-2,6-bisphosphatase PFKFB3 iPFK-2
Type:
Enzyme
Mol. Mass.:
59620.59
Organism:
Homo sapiens (Human)
Description:
Q16875
Residue:
520
  
Inhibitor
Name:
BDBM50508556
Synonyms:
CHEMBL4465233
Type:
Small organic molecule
Emp. Form.:
C27H22N8O
Mol. Mass.:
474.5166
SMILES:
Cn1cc(NC(=O)c2ccncc2Nc2cc(-c3ccc4ccn(C)c4c3)c3nccnc3c2)cn1
: