Target
Histone-lysine N-methyltransferase SETD1B
Ligand
BDBM50508569
Substrate
Meas. Tech.
ChEMBL_1833225 (CHEMBL4333233)
IC50
>100000±n/a nM
Citation
 Ye, XZhang, RLian, FZhang, WLu, WHan, JZhang, NJin, JLuo, CChen, KYe, FDing, H The identification of novel small-molecule inhibitors targeting WDR5-MLL1 interaction through fluorescence polarization based high-throughput screening. Bioorg Med Chem Lett 29:638-645 (2019)  
Target
Name:
Histone-lysine N-methyltransferase SETD1B
Synonyms:
2.1.1.354 KIAA1076 Lysine N-methyltransferase 2G SET1B SETD1B | hSET1B
Type:
PROTEIN
Mol. Mass.:
212716.30
Organism:
Homo sapiens
Description:
ChEMBL_117442
Residue:
1966
  
Inhibitor
Name:
BDBM50508569
Synonyms:
CHEMBL4557353
Type:
Small organic molecule
Emp. Form.:
C18H21NO5S
Mol. Mass.:
363.428
SMILES:
CCCCOc1ccc(cc1C)S(=O)(=O)Nc1ccc(cc1)C(O)=O
: