Target
Retinoic acid receptor alpha
Ligand
BDBM50061618
Substrate
Meas. Tech.
ChEMBL_197416 (CHEMBL799805)
Ki
900±n/a nM
Citation
 Umemiya, HFukasawa, HEbisawa, MEyrolles, LKawachi, EEisenmann, GGronemeyer, HHashimoto, YShudo, KKagechika, H Regulation of retinoidal actions by diazepinylbenzoic acids. Retinoid synergists which activate the RXR-RAR heterodimers. J Med Chem 40:4222-34 (1998)  
Target
Name:
Retinoic acid receptor alpha
Synonyms:
NR1B1 RAR-alpha RARA_HUMAN Retinoic acid receptor alpha/Retinoid X receptor alpha Retinoid receptor
Type:
PROTEIN
Mol. Mass.:
50778.87
Organism:
Homo sapiens (Human)
Description:
ChEMBL_1466191
Residue:
462
  
Inhibitor
Name:
BDBM50061618
Synonyms:
4-(7,7,10,10-Tetramethyl-7,8,9,10-tetrahydro-5-thia-13-aza-benzo[4,5]cyclohepta[1,2-b]naphthalen-12-yl)-benzoic acid | CHEMBL337859
Type:
Small organic molecule
Emp. Form.:
C28H27NO2S
Mol. Mass.:
441.584
SMILES:
CC1(C)CCC(C)(C)c2cc3c(Sc4ccccc4N=C3c3ccc(cc3)C(O)=O)cc12
: