Target
Adenosine receptor A2a
Ligand
BDBM10847
Substrate
Meas. Tech.
ChEMBL_32143 (CHEMBL646353)
Ki
19000±n/a nM
Citation
 Müller, CEGeis, UHipp, JSchobert, UFrobenius, WPawlowski, MSuzuki, FSandoval-Ramírez, J Synthesis and structure-activity relationships of 3,7-dimethyl-1-propargylxanthine derivatives, A2A-selective adenosine receptor antagonists. J Med Chem 40:4396-405 (1998)  
Target
Name:
Adenosine receptor A2a
Synonyms:
AA2AR_RAT Adenosine A2 receptor Adenosine Receptors A2a (A2a) Adenosine receptors A2a Rat striatal adenosine A2a receptor
Type:
G Protein-Coupled Receptor (GPCR)
Mol. Mass.:
45015.65
Organism:
Rattus norvegicus (rat)
Description:
Rat A2A receptors expressed in CHO cells.
Residue:
410
  
Inhibitor
Name:
BDBM10847
Synonyms:
1,3-dimethyl-2,3,6,7-tetrahydro-1H-purine-2,6-dione Afonilum Aminophylline Cardophyllin Theophy-lline Theophylline (1,3-dimethylxanthine)
Type:
Small organic molecule
Emp. Form.:
C7H8N4O2
Mol. Mass.:
180.164
SMILES:
Cn1c2nc[nH]c2c(=O)n(C)c1=O
: