Target
ATP-binding cassette sub-family C member 9/ATP-sensitive inward rectifier potassium channel 11
Ligand
BDBM50062394
Substrate
Meas. Tech.
ChEMBL_46128 (CHEMBL660002)
Ki
74±n/a nM
Citation
 Atwal, KSGrover, GJLodge, NJNormandin, DETraeger, SCSleph, PGCohen, RBBryson, CCDickinson, KE Binding of ATP-sensitive potassium channel (KATP) openers to cardiac membranes: correlation of binding affinities with cardioprotective and smooth muscle relaxing potencies. J Med Chem 41:271-5 (1998)  
Target
Name:
ATP-binding cassette sub-family C member 9/ATP-sensitive inward rectifier potassium channel 11
Synonyms:
Potassium channel, inwardly rectifying, subfamily J, member 11/Sulfonylurea receptor 2 | Sulfonylurea receptor 2, Kir6.2
Type:
Mol. Mass.:
Description:
ASSAY_ID of EBI is 46128
Components:
This complex has 2 components.
Component 1
Name:
ATP-binding cassette sub-family C member 9
Synonyms:
ABCC9 ATP-binding cassette transporter sub-family C member 9 Sulfonylurea receptor 2 | Sulfonylurea receptor 2, Kir6.2
Type:
PROTEIN
Mol. Mass.:
174236.59
Organism:
Homo sapiens (Human)
Description:
ChEMBL_495672
Residue:
1549
  
Component 2
Name:
ATP-sensitive inward rectifier potassium channel 11
Synonyms:
ATP-sensitive inward rectifier potassium channel 11 Inward rectifier K(+) channel Kir6.2 KCNJ11 Potassium channel, inwardly rectifying, subfamily J, member 11 Sulfonylurea receptor 2, Kir6.2
Type:
Enzyme Catalytic Domain
Mol. Mass.:
43549.41
Organism:
Homo sapiens (Human)
Description:
Potassium channel (ATP modulatory) 0 0::Q14654
Residue:
390
  
Inhibitor
Name:
BDBM50062394
Synonyms:
1N-cyanoimino(tert-pentylamino)methyl-4-iodoaniline | CHEMBL328308
Type:
Small organic molecule
Emp. Form.:
C13H17IN4
Mol. Mass.:
356.2053
SMILES:
CCC(C)(C)NC(Nc1ccc(I)cc1)=NC#N
: