Target
ATP-binding cassette sub-family C member 9/ATP-sensitive inward rectifier potassium channel 11
Ligand
BDBM50062396
Substrate
Meas. Tech.
ChEMBL_46128 (CHEMBL660002)
Ki
99±n/a nM
Citation
 Atwal, KSGrover, GJLodge, NJNormandin, DETraeger, SCSleph, PGCohen, RBBryson, CCDickinson, KE Binding of ATP-sensitive potassium channel (KATP) openers to cardiac membranes: correlation of binding affinities with cardioprotective and smooth muscle relaxing potencies. J Med Chem 41:271-5 (1998)  
Target
Name:
ATP-binding cassette sub-family C member 9/ATP-sensitive inward rectifier potassium channel 11
Synonyms:
Potassium channel, inwardly rectifying, subfamily J, member 11/Sulfonylurea receptor 2 | Sulfonylurea receptor 2, Kir6.2
Type:
Mol. Mass.:
Description:
ASSAY_ID of EBI is 46128
Components:
This complex has 2 components.
Component 1
Name:
ATP-binding cassette sub-family C member 9
Synonyms:
ABCC9 ATP-binding cassette transporter sub-family C member 9 Sulfonylurea receptor 2 | Sulfonylurea receptor 2, Kir6.2
Type:
PROTEIN
Mol. Mass.:
174236.59
Organism:
Homo sapiens (Human)
Description:
ChEMBL_495672
Residue:
1549
  
Component 2
Name:
ATP-sensitive inward rectifier potassium channel 11
Synonyms:
ATP-sensitive inward rectifier potassium channel 11 Inward rectifier K(+) channel Kir6.2 KCNJ11 Potassium channel, inwardly rectifying, subfamily J, member 11 Sulfonylurea receptor 2, Kir6.2
Type:
Enzyme Catalytic Domain
Mol. Mass.:
43549.41
Organism:
Homo sapiens (Human)
Description:
Potassium channel (ATP modulatory) 0 0::Q14654
Residue:
390
  
Inhibitor
Name:
BDBM50062396
Synonyms:
4-cyanoimino(1,2,2-trimethylpropylamino)methylaminobenzonitrile N''-cyano-N-(4-cyanophenyl)-N'-(1,2,2-trimethylpropyl)guanidine | N''-cyano-N-(4-cyanophenyl)-N'-(1,2,2-trimethylpropyl)guanidine (BMS-182264)
Type:
Small organic molecule
Emp. Form.:
C15H19N5
Mol. Mass.:
269.3449
SMILES:
CC(NC(Nc1ccc(cc1)C#N)=NC#N)C(C)(C)C
: