Target
Methylated-DNA--protein-cysteine methyltransferase
Ligand
BDBM50062816
Substrate
Meas. Tech.
ChEMBL_144844 (CHEMBL752890)
IC50
230±n/a nM
Citation
 Terashima, IKohda, K Inhibition of human O6-alkylguanine-DNA alkyltransferase and potentiation of the cytotoxicity of chloroethylnitrosourea by 4(6)-(benzyloxy)-2,6(4)-diamino-5-(nitro or nitroso)pyrimidine derivatives and analogues. J Med Chem 41:503-8 (1998)  
Target
Name:
Methylated-DNA--protein-cysteine methyltransferase
Synonyms:
6-O-methylguanine-DNA methyltransferase MGMT_HUMAN
Type:
PROTEIN
Mol. Mass.:
21651.27
Organism:
Homo sapiens (Human)
Description:
ChEMBL_144711
Residue:
207
  
Inhibitor
Name:
BDBM50062816
Synonyms:
5-Nitroso-6-(pyridin-4-ylmethoxy)-pyrimidine-2,4-diamine | CHEMBL358907
Type:
Small organic molecule
Emp. Form.:
C10H10N6O2
Mol. Mass.:
246.2254
SMILES:
Nc1nc(N)c(N=O)c(OCc2ccncc2)n1
: