Target
Matrix metalloproteinase-9
Ligand
BDBM50063912
Substrate
Meas. Tech.
ChEMBL_105225 (CHEMBL710584)
IC50
0.200000±n/a nM
Citation
 Yamamoto, MTsujishita, HHori, NOhishi, YInoue, SIkeda, SOkada, Y Inhibition of membrane-type 1 matrix metalloproteinase by hydroxamate inhibitors: an examination of the subsite pocket. J Med Chem 41:1209-17 (1998)  
Target
Name:
Matrix metalloproteinase-9
Synonyms:
67 kDa matrix metalloproteinase-9 92 kDa gelatinase CLG4B Gelatinase B MMP9 Matrix metalloproteinase 9 (MMP-9) Matrix metalloproteinase-9 (MMP9)
Type:
Enzyme
Mol. Mass.:
78452.28
Organism:
Homo sapiens (Human)
Description:
P14780
Residue:
707
  
Inhibitor
Name:
BDBM50063912
Synonyms:
(R)-N*4*-Hydroxy-N*1*-((S)-methylcarbamoyl-phenyl-methyl)-2-nonyl-succinamide | CHEMBL433426
Type:
Small organic molecule
Emp. Form.:
C22H35N3O4
Mol. Mass.:
405.531
SMILES:
CCCCCCCCC[C@H](CC(=O)NO)C(=O)N[C@H](C(=O)NC)c1ccccc1
: