Target
Prostaglandin G/H synthase 1
Ligand
BDBM17638
Substrate
Meas. Tech.
ChEMBL_1839848 (CHEMBL4340063)
IC50
100±n/a nM
Citation
 Lolli, MLCarnovale, IMPippione, ACWahlgren, WYBonanni, DMarini, EZonari, DGallicchio, MBoscaro, VGoyal, PFriemann, RRolando, BBagnati, RAdinolfi, SOliaro-Bosso, SBoschi, D Bioisosteres of Indomethacin as Inhibitors of Aldo-Keto Reductase 1C3. ACS Med Chem Lett 10:437-443 (2019)  
Target
Name:
Prostaglandin G/H synthase 1
Synonyms:
COX1 Cyclooxygenase-1 (COX-1) PTGS1 | Prostaglandin G/H synthase (cyclooxygenase)
Type:
Protein
Mol. Mass.:
68868.60
Organism:
Ovis aries (Sheep)
Description:
Residue:
600
  
Inhibitor
Name:
BDBM17638
Synonyms:
2-{1-[(4-chlorophenyl)carbonyl]-5-methoxy-2-methyl-1H-indol-3-yl}acetic acid Indocin US11478464, Compound Indomethacin US9271961, Indomethacin | indometacin
Type:
Small organic molecule
Emp. Form.:
C19H16ClNO4
Mol. Mass.:
357.788
SMILES:
COc1ccc2n(C(=O)c3ccc(Cl)cc3)c(C)c(CC(O)=O)c2c1
: