Target
Acid-sensing ion channel 1
Ligand
BDBM50510046
Substrate
Meas. Tech.
ChEMBL_1839999 (CHEMBL4340214)
IC50
>30000±n/a nM
Citation
 Bencheva, LIDe Matteo, MFerrante, LFerrara, MPrandi, ARandazzo, PRonzoni, SSinisi, RSeneci, PSumma, VGallo, MVeneziano, MCellucci, AMazzocchi, NMenegon, ADi Fabio, R Identification of Isoform 2 Acid-Sensing Ion Channel Inhibitors as Tool Compounds for Target Validation Studies in CNS. ACS Med Chem Lett 10:627-632 (2019)  
Target
Name:
Acid-sensing ion channel 1
Synonyms:
ASIC1_MOUSE Acid-sensing ion channel Amiloride-sensitive cation channel 2, neuronal Asic1 Brain sodium channel 2
Type:
PROTEIN
Mol. Mass.:
59657.36
Organism:
Mus musculus
Description:
ChEMBL_119368
Residue:
526
  
Inhibitor
Name:
BDBM50510046
Synonyms:
CHEMBL4440380
Type:
Small organic molecule
Emp. Form.:
C19H18FN3
Mol. Mass.:
307.3647
SMILES:
Cc1nn(c(C)c1-c1ccc(F)cc1)-c1ccc2CCNc2c1
: