Target
Hypoxia-inducible factor 1-alpha inhibitor
Ligand
BDBM50317547
Substrate
Meas. Tech.
ChEMBL_1840411 (CHEMBL4340710)
IC50
21000±n/a nM
Citation
 Langley, GWAbboud, MILohans, CTSchofield, CJ Inhibition of a viral prolyl hydroxylase. Bioorg Med Chem 27:2405-2412 (2019)  
Target
Name:
Hypoxia-inducible factor 1-alpha inhibitor
Synonyms:
FIH1 HIF1N_HUMAN Hypoxia-inducible factor 1-alpha inhibitor
Type:
Enzyme
Mol. Mass.:
40278.92
Organism:
Homo sapiens (Human)
Description:
Q9NWT6
Residue:
349
  
Inhibitor
Name:
BDBM50317547
Synonyms:
CHEMBL4163812
Type:
Small organic molecule
Emp. Form.:
C19H27N3O6
Mol. Mass.:
393.4342
SMILES:
OC(=O)CNC(=O)c1c(O)n(C2CCCCC2)c(=O)n(C2CCCCC2)c1=O
: