Target
DNA gyrase subunit A/B
Ligand
BDBM50510295
Substrate
Meas. Tech.
ChEMBL_1841327 (CHEMBL4341626)
IC50
40±n/a nM
Citation
 Thalji, RKRaha, KAndreotti, DChecchia, ACui, HMeneghelli, GProfeta, RTonelli, FTommasi, SBakshi, TDonovan, BTHowells, AJain, SNixon, CQuinque, GMcCloskey, LBax, BDNeu, MChan, PFStavenger, RA Structure-guided design of antibacterials that allosterically inhibit DNA gyrase. Bioorg Med Chem Lett 29:1407-1412 (2019)  
Target
Name:
DNA gyrase subunit A/B
Synonyms:
DNA Gyrase | DNA gyrase A/B
Type:
A2B2 tetramer
Mol. Mass.:
Description:
Components:
This complex has 2 components.
Component 1
Name:
DNA gyrase subunit A
Synonyms:
DNA gyrase GYRA_ECOLI hisW parD
Type:
Enzyme Subunit
Mol. Mass.:
96935.15
Organism:
Escherichia coli (strain K12)
Description:
Residue:
875
  
Component 2
Name:
DNA gyrase subunit B
Synonyms:
DNA gyrase subunit B GYRB_ECOLI acrB gyrB hisU parA | pcbA
Type:
Enzyme Subunit
Mol. Mass.:
89941.28
Organism:
Escherichia coli (strain K12)
Description:
P0AES6
Residue:
804
  
Inhibitor
Name:
BDBM50510295
Synonyms:
CHEMBL4443422
Type:
Small organic molecule
Emp. Form.:
C20H19ClN2OS
Mol. Mass.:
370.896
SMILES:
Cc1sc(cc1C(=O)N[C@@H](CN)c1ccccc1)-c1ccccc1Cl
: