Target
DNA gyrase subunit A/B
Ligand
BDBM50510297
Substrate
Meas. Tech.
ChEMBL_1841327 (CHEMBL4341626)
IC50
10000±n/a nM
Citation
 Thalji, RKRaha, KAndreotti, DChecchia, ACui, HMeneghelli, GProfeta, RTonelli, FTommasi, SBakshi, TDonovan, BTHowells, AJain, SNixon, CQuinque, GMcCloskey, LBax, BDNeu, MChan, PFStavenger, RA Structure-guided design of antibacterials that allosterically inhibit DNA gyrase. Bioorg Med Chem Lett 29:1407-1412 (2019)  
Target
Name:
DNA gyrase subunit A/B
Synonyms:
DNA Gyrase | DNA gyrase A/B
Type:
A2B2 tetramer
Mol. Mass.:
Description:
Components:
This complex has 2 components.
Component 1
Name:
DNA gyrase subunit A
Synonyms:
DNA gyrase GYRA_ECOLI hisW parD
Type:
Enzyme Subunit
Mol. Mass.:
96935.15
Organism:
Escherichia coli (strain K12)
Description:
Residue:
875
  
Component 2
Name:
DNA gyrase subunit B
Synonyms:
DNA gyrase subunit B GYRB_ECOLI acrB gyrB hisU parA | pcbA
Type:
Enzyme Subunit
Mol. Mass.:
89941.28
Organism:
Escherichia coli (strain K12)
Description:
P0AES6
Residue:
804
  
Inhibitor
Name:
BDBM50510297
Synonyms:
CHEMBL4577405
Type:
Small organic molecule
Emp. Form.:
C23H20ClN3
Mol. Mass.:
373.878
SMILES:
NC[C@H](Nc1nccc2ccc(cc12)-c1ccccc1Cl)c1ccccc1
: