Target
Tyrosine-protein kinase JAK2
Ligand
BDBM50352560
Substrate
Meas. Tech.
ChEMBL_1841388 (CHEMBL4341687)
IC50
65±n/a nM
Citation
 Wang, WDiao, YLi, WLuo, YYang, TZhao, YQi, TXu, FMa, XGe, HLiang, YZhao, ZLiang, XWang, RZhu, LLi, HXu, Y Design, synthesis and structure-activity relationship study of aminopyridine derivatives as novel inhibitors of Janus kinase 2. Bioorg Med Chem Lett 29:1507-1513 (2019)  
Target
Name:
Tyrosine-protein kinase JAK2
Synonyms:
JAK-2 JAK2_HUMAN Janus kinase 2 (JAK2) | Janus kinase 2 (a protein tyrosine kinase)
Type:
Protein
Mol. Mass.:
130684.68
Organism:
Homo sapiens (Human)
Description:
O60674
Residue:
1132
  
Inhibitor
Name:
BDBM50352560
Synonyms:
CHEMBL1825137
Type:
Small organic molecule
Emp. Form.:
C21H21Cl2FN4O2
Mol. Mass.:
451.321
SMILES:
CC(Oc1cc(cnc1N)-c1cnn(c1)C1CCOCC1)c1c(Cl)ccc(F)c1Cl
: