Target
Mu-type opioid receptor
Ligand
BDBM50454930
Substrate
Meas. Tech.
ChEMBL_149136 (CHEMBL759227)
Ki
56±n/a nM
Citation
 Thomas, JBMascarella, SWRothman, RBPartilla, JSXu, HMcCullough, KBDersch, CMCantrell, BEZimmerman, DMCarroll, FI Investigation of the N-substituent conformation governing potency and mu receptor subtype-selectivity in (+)-(3R, 4R)-dimethyl-4-(3-hydroxyphenyl)piperidine opioid antagonists. J Med Chem 41:1980-90 (1998)  
Target
Name:
Mu-type opioid receptor
Synonyms:
MOR-1 Mu-type opioid receptor (MOR) OPRM_RAT Opioid receptor B Ror-b
Type:
G Protein-Coupled Receptor (GPCR)
Mol. Mass.:
44503.11
Organism:
Rattus norvegicus (rat)
Description:
Competition binding assays were carried out using membrane preparations from transfected HN9.10 cells that constitutively expressed the mu opioid receptor.
Residue:
398
  
Inhibitor
Name:
BDBM50454930
Synonyms:
CHEMBL2113734
Type:
Small organic molecule
Emp. Form.:
C23H29NO
Mol. Mass.:
335.4825
SMILES:
C[C@H]1CN(C[C@H]2C[C@@H]2c2ccccc2)CC[C@@]1(C)c1cccc(O)c1
: