Target
5-hydroxytryptamine receptor 2C
Ligand
BDBM50064703
Substrate
Meas. Tech.
ChEMBL_2964 (CHEMBL617904)
Ki
0.300000±n/a nM
Citation
 Monte, APMarona-Lewicka, DLewis, MMMailman, RBWainscott, DBNelson, DLNichols, DE Substituted naphthofurans as hallucinogenic phenethylamine-ergoline hybrid molecules with unexpected muscarinic antagonist activity. J Med Chem 41:2134-45 (1998)  
Target
Name:
5-hydroxytryptamine receptor 2C
Synonyms:
5-HT-2C 5-HT2C-INI 5-HTR2C 5-hydroxytryptamine receptor 2C (5-HT-2C) 5HT-1C HTR1C Serotonin (5-HT3) receptor Serotonin Receptor 2C
Type:
G Protein-Coupled Receptor (GPCR)
Mol. Mass.:
51836.79
Organism:
Homo sapiens (Human)
Description:
P28335
Residue:
458
  
Inhibitor
Name:
BDBM50064703
Synonyms:
(R)-2-(8-Bromo-2,3,6,7-tetrahydro-benzo[1,2-b;4,5-b']difuran-4-yl)-1-methyl-ethylamine | CHEMBL305275
Type:
Small organic molecule
Emp. Form.:
C13H16BrNO2
Mol. Mass.:
298.176
SMILES:
C[C@@H](N)Cc1c2CCOc2c(Br)c2CCOc12
: