Target
5-hydroxytryptamine receptor 1B
Ligand
BDBM50064783
Substrate
Meas. Tech.
ChEMBL_1585 (CHEMBL616996)
Ki
26021±n/a nM
Citation
 Ennis, MDGhazal, NBHoffman, RLSmith, MWSchlachter, SKLawson, CFIm, WBPregenzer, JFSvensson, KALewis, RAHall, EDSutter, DMHarris, LTMcCall, RB Isochroman-6-carboxamides as highly selective 5-HT1D agonists: potential new treatment for migraine without cardiovascular side effects. J Med Chem 41:2180-3 (1998)  
Target
Name:
5-hydroxytryptamine receptor 1B
Synonyms:
5-HT-1B 5HT1B_GORGO Serotonin receptor 1B
Type:
PROTEIN
Mol. Mass.:
43466.06
Organism:
Gorilla gorilla gorilla
Description:
ChEMBL_105571
Residue:
389
  
Inhibitor
Name:
BDBM50064783
Synonyms:
(R)-1-{2-[4-(4-Methoxy-phenyl)-piperazin-1-yl]-ethyl}-isochroman-6-carboxylic acid amide | CHEMBL71907
Type:
Small organic molecule
Emp. Form.:
C23H29N3O3
Mol. Mass.:
395.4947
SMILES:
COc1ccc(cc1)N1CCN(CC[C@H]2OCCc3cc(ccc23)C(N)=O)CC1
: