Target
Dual specificity protein phosphatase 1
Ligand
BDBM50510655
Substrate
Meas. Tech.
ChEMBL_1841934 (CHEMBL4342233)
IC50
6600±n/a nM
Citation
 Yeon Kim, BHee Yoon, JKim, MNyoung Kim, JPark, HEon Ryu, SLee, S Synthesis and biological evaluation of acylthiourea against DUSP1 inhibition. Bioorg Med Chem Lett 29:1746-1748 (2019)  
Target
Name:
Dual specificity protein phosphatase 1
Synonyms:
CL100 DUSP1 MAP kinase phosphatase 1 MKP1 Protein-tyrosine phosphatase CL100 | VH1
Type:
Protein phosphatase
Mol. Mass.:
39301.48
Organism:
Homo sapiens (Human)
Description:
gi_4758204
Residue:
367
  
Inhibitor
Name:
BDBM50510655
Synonyms:
CHEMBL4579674
Type:
Small organic molecule
Emp. Form.:
C23H19N3O2S
Mol. Mass.:
401.481
SMILES:
Cc1ccc(cc1)C(=O)NC(=S)Nc1cccc(c1)-c1nc2cc(C)ccc2o1
: