Target
Beta-secretase 1
Ligand
BDBM50510795
Substrate
Meas. Tech.
ChEMBL_1842193 (CHEMBL4342620)
IC50
0.090000±n/a nM
Citation
 Hsiao, CCRombouts, FGijsen, HJM New evolutions in the BACE1 inhibitor field from 2014 to 2018. Bioorg Med Chem Lett 29:761-777 (2019)  
Target
Name:
Beta-secretase 1
Synonyms:
ASP2 Aspartyl protease 2 BACE1 Beta-secretase (BACE) Beta-secretase 1 (BACE 1) Beta-secretase 1 (BACE1) Beta-site amyloid precursor protein cleaving enzyme 1 Memapsin-2 beta-Secretase (BACE-1) | beta-Secretase (BACE1)
Type:
Protein
Mol. Mass.:
55755.10
Organism:
Homo sapiens (Human)
Description:
P56817
Residue:
501
  
Inhibitor
Name:
BDBM50510795
Synonyms:
CHEMBL4561849
Type:
Small organic molecule
Emp. Form.:
C23H25FN6O2S
Mol. Mass.:
468.547
SMILES:
[H][C@@]12CCN=[S@]1(=O)C(C)(C)C(N)=N[C@]2(C)c1cc(NC(=O)c2ncc(cc2C)C#N)ccc1F
: