Target
Acetylcholinesterase
Ligand
BDBM50510846
Substrate
Meas. Tech.
ChEMBL_1842270 (CHEMBL4342697)
IC50
0.000±n/a nM
Citation
 Mishra, PKumar, APanda, G Anti-cholinesterase hybrids as multi-target-directed ligands against Alzheimer's disease (1998-2018). Bioorg Med Chem 27:895-930 (2019)  
Target
Name:
Acetylcholinesterase
Synonyms:
ACES_HUMAN Acetylcholinesterase (AChE) | Acetylcholinesterase (human AChE)
Type:
Enzyme
Mol. Mass.:
67792.70
Organism:
Homo sapiens (Human)
Description:
P22303
Residue:
614
  
Inhibitor
Name:
BDBM50510846
Synonyms:
CHEMBL4590945
Type:
Small organic molecule
Emp. Form.:
C31H36Cl2N4O
Mol. Mass.:
551.55
SMILES:
Clc1cc(Cl)c2c(NCCCCCCCC(=O)NCCc3c[nH]c4ccccc34)c3CCCCc3nc2c1
: