Target
Insulin-like growth factor 1 receptor
Ligand
BDBM50065297
Substrate
Meas. Tech.
ChEMBL_90281 (CHEMBL697346)
IC50
10000±n/a nM
Citation
 Sun, LTran, NTang, FApp, HHirth, PMcMahon, GTang, C Synthesis and biological evaluations of 3-substituted indolin-2-ones: a novel class of tyrosine kinase inhibitors that exhibit selectivity toward particular receptor tyrosine kinases. J Med Chem 41:2588-603 (1998)  
Target
Name:
Insulin-like growth factor 1 receptor
Synonyms:
CD_antigen=CD221 IGF1R Insulin-like growth factor 1 receptor (IGF1R) Insulin-like growth factor 1 receptor alpha chain Insulin-like growth factor I receptor | Insulin-like growth factor receptor (IGFR)
Type:
Protein
Mol. Mass.:
154776.79
Organism:
Homo sapiens (Human)
Description:
P08069
Residue:
1367
  
Inhibitor
Name:
BDBM50065297
Synonyms:
3-(4-Isopropyl-benzylidene)-1,3-dihydro-indol-2-one CHEMBL48760
Type:
Small organic molecule
Emp. Form.:
C18H17NO
Mol. Mass.:
263.3337
SMILES:
CC(C)c1ccc(\C=C2\C(=O)Nc3ccccc23)cc1
: