Target
Beta-secretase 1
Ligand
BDBM50510993
Substrate
Meas. Tech.
ChEMBL_1842975 (CHEMBL4343402)
IC50
0.200000±n/a nM
Citation
 Pettus, LHBourbeau, MPBradley, JBartberger, MDChen, KHickman, DJohnson, MLiu, QManning, JRNanez, ASiegmund, ACWen, PHWhittington, DAAllen, JRWood, S Discovery of AM-6494: A Potent and Orally Efficacious ?-Site Amyloid Precursor Protein Cleaving Enzyme 1 (BACE1) Inhibitor with in Vivo Selectivity over BACE2. J Med Chem 63:2263-2281 (2020)  
Target
Name:
Beta-secretase 1
Synonyms:
ASP2 Aspartyl protease 2 BACE1 Beta-secretase (BACE) Beta-secretase 1 (BACE 1) Beta-secretase 1 (BACE1) Beta-site amyloid precursor protein cleaving enzyme 1 Memapsin-2 beta-Secretase (BACE-1) | beta-Secretase (BACE1)
Type:
Protein
Mol. Mass.:
55755.10
Organism:
Homo sapiens (Human)
Description:
P56817
Residue:
501
  
Inhibitor
Name:
BDBM50510993
Synonyms:
CHEMBL4437161
Type:
Small organic molecule
Emp. Form.:
C21H18F3N5O2S
Mol. Mass.:
461.46
SMILES:
[H][C@@]12C[C@]1(CF)SC(N)=N[C@]2(C)c1cc(NC(=O)c2cnc(OCC#C)cn2)cc(F)c1F
: