Target
Ketohexokinase
Ligand
BDBM50241178
Substrate
Meas. Tech.
ChEMBL_1843863 (CHEMBL4344290)
IC50
340±n/a nM
Citation
 Romero, FAJones, CTXu, YFenaux, MHalcomb, RL The Race to Bash NASH: Emerging Targets and Drug Development in a Complex Liver Disease. J Med Chem 63:5031-5073 (2020)  
Target
Name:
Ketohexokinase
Synonyms:
2.7.1.3 KHK_RAT Khk
Type:
PROTEIN
Mol. Mass.:
32749.44
Organism:
Rattus norvegicus
Description:
ChEMBL_117528
Residue:
298
  
Inhibitor
Name:
BDBM50241178
Synonyms:
CHEMBL4070442
Type:
Small organic molecule
Emp. Form.:
C16H19F3N4O3
Mol. Mass.:
372.3423
SMILES:
C[C@]1(O)CCN(C1)c1nc(cc(c1C#N)C(F)(F)F)N1C[C@H](O)[C@@H](O)C1
: