Target
D(2) dopamine receptor
Ligand
BDBM50511517
Substrate
Meas. Tech.
ChEMBL_1844915 (CHEMBL4345342)
IC50
0.124000±n/a nM
Citation
 Park, HUrs, ANZimmerman, JLiu, CWang, QUrs, NM Structure-Functional-Selectivity Relationship Studies of Novel Apomorphine Analogs to Develop D1R/D2R Biased Ligands. ACS Med Chem Lett 11:385-392 (2020)  
Target
Name:
D(2) dopamine receptor
Synonyms:
D(2) dopamine receptor DOPAMINE D2 Long DRD2 Dopamine D2 receptor Dopamine D2 receptor (D2R) Dopamine2-like | d2
Type:
Cell-surface receptors
Mol. Mass.:
50647.10
Organism:
Homo sapiens (Human)
Description:
P14416
Residue:
443
  
Inhibitor
Name:
BDBM50511517
Synonyms:
CHEMBL4467483
Type:
Small organic molecule
Emp. Form.:
C19H20BrNO2
Mol. Mass.:
374.272
SMILES:
[H][C@]12Cc3ccc(OC)c(OC)c3-c3c(Br)ccc(CCN1C)c23
: