Target
Chymotrypsinogen A
Ligand
BDBM50066999
Substrate
Meas. Tech.
ChEMBL_49929 (CHEMBL660312)
IC50
980.0±n/a nM
Citation
 Macdonald, SJBelton, DJBuckley, DMSpooner, JEAnson, MSHarrison, LAMills, KUpton, RJDowle, MDSmith, RAMolloy, CRRisley, C Syntheses of trans-5-oxo-hexahydro-pyrrolo[3,2-b]pyrroles and trans-5-oxo-hexahydro-furo[3,2-b]pyrroles (pyrrolidine trans-lactams and trans-lactones): new pharmacophores for elastase inhibition. J Med Chem 41:3919-22 (1998)  
Target
Name:
Chymotrypsinogen A
Synonyms:
Alpha-chymotrypsin Chymotrypsin A Chymotrypsin A chain B Chymotrypsinogen A | alpha-Chymotrypsin (α-Chymotrypsin)
Type:
Serine protease
Mol. Mass.:
25670.88
Organism:
Bos taurus (bovine)
Description:
Residue:
245
  
Inhibitor
Name:
BDBM50066999
Synonyms:
(S)-3,3-Diethyl-2-[4-(4-methyl-piperazine-1-carbonyl)-phenoxy]-4-oxo-azetidine-1-carboxylic acid ((R)-1-benzo[1,3]dioxol-5-yl-butyl)-amide CHEMBL310871 | L-694458
Type:
Small organic molecule
Emp. Form.:
C31H40N4O6
Mol. Mass.:
564.6725
SMILES:
CCC[C@@H](NC(=O)N1[C@@H](Oc2ccc(cc2)C(=O)N2CCN(C)CC2)C(CC)(CC)C1=O)c1ccc2OCOc2c1
: