Target
Acyl-CoA:cholesterol acyltransferase
Ligand
BDBM50067769
Substrate
Meas. Tech.
ChEMBL_28169 (CHEMBL644123)
IC50
9.1±n/a nM
Citation
 Tanaka, ATerasawa, THagihara, HIshibe, NSawada, MSakuma, YHashimoto, MTakasugi, HTanaka, H Inhibitors of acyl-CoA:cholesterol O-acyltransferase. 3. Discovery of a novel series of N-alkyl-N-[(fluorophenoxy)benzyl]-N'-arylureas with weak toxicological effects on adrenal glands. J Med Chem 41:4408-20 (1998)  
Target
Name:
Acyl-CoA:cholesterol acyltransferase
Synonyms:
ACAT
Type:
Mol. Mass.:
35405.31
Organism:
Oryctolagus cuniculus
Description:
Residue:
305
  
Inhibitor
Name:
BDBM50067769
Synonyms:
1-Benzyl-1-[4-(4-fluoro-phenoxy)-benzyl]-3-(6-methyl-2,4-bis-methylsulfanyl-pyridin-3-yl)-urea | CHEMBL140181
Type:
Small organic molecule
Emp. Form.:
C29H28FN3O2S2
Mol. Mass.:
533.68
SMILES:
CSc1cc(C)nc(SC)c1NC(=O)N(Cc1ccccc1)Cc1ccc(Oc2ccc(F)cc2)cc1
: