Target
Histone-lysine N-methyltransferase EHMT1
Ligand
BDBM50300041
Substrate
Meas. Tech.
ChEMBL_1849742 (CHEMBL4350283)
IC50
23±n/a nM
Citation
 Leenders, RZijlmans, Rvan Bree, Bvan de Sande, MTrivarelli, FDamen, EWegert, AMüller, DEhlert, JEFeger, DHeidemann-Dinger, CKubbutat, MSchächtele, CLenstra, DCMecinovi?, JMüller, G Novel SAR for quinazoline inhibitors of EHMT1 and EHMT2. Bioorg Med Chem Lett 29:2516-2524 (2019)  
Target
Name:
Histone-lysine N-methyltransferase EHMT1
Synonyms:
EHMT1 EUHMTASE1 Euchromatic histone-lysine N-methyltransferase 1 GLP H3-K9-HMTase 5 Histone-lysine N-methyltransferase EHMT1/EHMT2 KMT1D | Lysine N-methyltransferase 1D
Type:
PROTEIN
Mol. Mass.:
141443.67
Organism:
Homo sapiens (Human)
Description:
ChEMBL_1450367
Residue:
1298
  
Inhibitor
Name:
BDBM50300041
Synonyms:
7-(3-(dimethylamino)propoxy)-6-methoxy-2-(4-methyl-1,4-diazepan-1-yl)-N-(1-methylpiperidin-4-yl)quinazolin-4-amine CHEMBL576781 | UNC0224
Type:
Small organic molecule
Emp. Form.:
C26H43N7O2
Mol. Mass.:
485.6653
SMILES:
COc1cc2c(NC3CCN(C)CC3)nc(nc2cc1OCCCN(C)C)N1CCCN(C)CC1
: