Target
Plasminogen
Ligand
BDBM50428067
Substrate
Meas. Tech.
ChEMBL_1855576 (CHEMBL4356305)
Kd
1100±n/a nM
Citation
 Steinmetzer, TPilgram, OWenzel, BMWiedemeyer, SJA Fibrinolysis Inhibitors: Potential Drugs for the Treatment and Prevention of Bleeding. J Med Chem 63:1445-1472 (2020)  
Target
Name:
Plasminogen
Synonyms:
Activation peptide PLG Plasmin Plasmin heavy chain A, short form | Plasmin light chain B
Type:
Enzyme
Mol. Mass.:
90579.18
Organism:
Homo sapiens (Human)
Description:
Residue:
810
  
Inhibitor
Name:
BDBM50428067
Synonyms:
CL-65336 Lysteda Trans Amcha
Type:
Small organic molecule
Emp. Form.:
C8H15NO2
Mol. Mass.:
157.2102
SMILES:
NC[C@H]1CC[C@@H](CC1)C(O)=O
: