Target
GTPase KRas
Ligand
BDBM50514381
Substrate
Meas. Tech.
ChEMBL_1856529 (CHEMBL4357258)
IC50
53±n/a nM
Target
Name:
GTPase KRas
Synonyms:
GTPase KRas, N-terminally processed KRAS Ki-Ras RASK_HUMAN c-Ki-ras
Type:
PROTEIN
Mol. Mass.:
21656.10
Organism:
Homo sapiens (Human)
Description:
ChEMBL_1476955
Residue:
189
  
Inhibitor
Name:
BDBM50514381
Synonyms:
CHEMBL4516179
Type:
Small organic molecule
Emp. Form.:
C28H29ClFN7O3
Mol. Mass.:
566.026
SMILES:
CC(C)n1ncc(C)c1-n1c2nc(c(Cl)cc2c(nc1=O)N1CCN(C[C@@H]1C)C(=O)C=C)-c1c(O)cccc1F
: