Target
GTPase KRas
Ligand
BDBM50514393
Substrate
Meas. Tech.
ChEMBL_1856530 (CHEMBL4357259)
IC50
11±n/a nM
Target
Name:
GTPase KRas
Synonyms:
GTPase KRas, N-terminally processed KRAS Ki-Ras RASK_HUMAN c-Ki-ras
Type:
PROTEIN
Mol. Mass.:
21656.10
Organism:
Homo sapiens (Human)
Description:
ChEMBL_1476955
Residue:
189
  
Inhibitor
Name:
BDBM50514393
Synonyms:
CHEMBL4539214
Type:
Small organic molecule
Emp. Form.:
C30H30ClFN6O3
Mol. Mass.:
577.049
SMILES:
CC(C)c1nccc(C)c1-n1c2nc(c(Cl)cc2c(nc1=O)N1CCN(C[C@@H]1C)C(=O)C=C)-c1c(O)cccc1F
: