Target
Low affinity immunoglobulin epsilon Fc receptor
Ligand
BDBM50069599
Substrate
Meas. Tech.
ChEBML_41669
IC50
3000±n/a nM
Citation
 Bailey, SBolognese, BBuckle, DRFaller, AJackson, SLouis-Flamberg, PMcCord, MMayer, RJMarshall, LASmith, DG Selective inhibition of low affinity IgE receptor (CD23) processing. Bioorg Med Chem Lett 8:29-34 (1999)  
Target
Name:
Low affinity immunoglobulin epsilon Fc receptor
Synonyms:
BLAST-2 CD_antigen=CD23 FCE2 FCER2_HUMAN IGEBF Immunoglobulin epsilon Fc receptor Low affinity immunoglobulin epsilon Fc receptor membrane-bound form Lymphocyte IgE receptor
Type:
PROTEIN
Mol. Mass.:
36461.84
Organism:
Homo sapiens (Human)
Description:
ChEMBL_88888
Residue:
321
  
Inhibitor
Name:
BDBM50069599
Synonyms:
(R)-N*1*-((S)-1-Carbamoyl-2-phenyl-ethyl)-N*4*-hydroxy-2-isobutyl-succinamide | CHEMBL326985
Type:
Small organic molecule
Emp. Form.:
C17H25N3O4
Mol. Mass.:
335.3981
SMILES:
CC(C)C[C@H](CC(=O)NO)C(=O)N[C@@H](Cc1ccccc1)C(N)=O
: