Target
Acidic mammalian chitinase
Ligand
BDBM50514507
Substrate
Meas. Tech.
ChEMBL_1856958 (CHEMBL4357687)
Ki
9720±n/a nM
Citation
 Jiang, XKumar, AMotomura, YLiu, TZhou, YMoro, KZhang, KYJYang, Q A Series of Compounds Bearing a Dipyrido-Pyrimidine Scaffold Acting as Novel Human and Insect Pest Chitinase Inhibitors. J Med Chem 63:987-1001 (2020)  
Target
Name:
Acidic mammalian chitinase
Synonyms:
AMCase CHIA Lung-specific protein TSA1902
Type:
Protein
Mol. Mass.:
52266.66
Organism:
Homo sapiens (Human)
Description:
Q9BZP6
Residue:
476
  
Inhibitor
Name:
BDBM50514507
Synonyms:
CHEMBL1583158
Type:
Small organic molecule
Emp. Form.:
C24H24N6O3
Mol. Mass.:
444.4858
SMILES:
Cc1cccn2c1nc1n(CC3CCCO3)c(=N)c(cc1c2=O)C(=O)NCc1cccnc1
: