Target
Endoplasmic reticulum aminopeptidase 1
Ligand
BDBM50514671
Substrate
Meas. Tech.
ChEMBL_1858111 (CHEMBL4358840)
IC50
1000±n/a nM
Citation
 Liddle, JHutchinson, JPKitchen, SRowland, PNeu, MCecconie, THolmes, DSJones, EKorczynska, JKoumantou, DLea, JDNickels, LPemberton, MPhillipou, ASchneck, JLSheehan, HTinworth, CPUings, IWojno-Picon, JYoung, RJStratikos, E Targeting the Regulatory Site of ER Aminopeptidase 1 Leads to the Discovery of a Natural Product Modulator of Antigen Presentation. J Med Chem 63:3348-3358 (2020)  
Target
Name:
Endoplasmic reticulum aminopeptidase 1
Synonyms:
APPILS Aminopeptidase ERAP1_HUMAN | KIAA0525
Type:
PROTEIN
Mol. Mass.:
107232.03
Organism:
Homo sapiens (Human)
Description:
ChEMBL_1473167
Residue:
941
  
Inhibitor
Name:
BDBM50514671
Synonyms:
CHEMBL4532803
Type:
Small organic molecule
Emp. Form.:
C20H31NO4
Mol. Mass.:
349.4644
SMILES:
N.[H][C@]12CCC=C(C(O)=O)[C@]1(C)[C@@H](O)C[C@@H](C)[C@]2(C)CCc1ccoc1
: