Target
Chromatin remodeling regulator CECR2
Ligand
BDBM50514852
Substrate
Meas. Tech.
ChEMBL_1858859 (CHEMBL4359588)
IC50
251±n/a nM
Citation
 Lucas, SCCAtkinson, SJBamborough, PBarnett, HChung, CWGordon, LMitchell, DJPhillipou, APrinjha, RKSheppard, RJTomkinson, NCOWatson, RJDemont, EH Optimization of Potent ATAD2 and CECR2 Bromodomain Inhibitors with an Atypical Binding Mode. J Med Chem 63:5212-5241 (2020)  
Target
Name:
Chromatin remodeling regulator CECR2
Synonyms:
CECR2 Cat eye syndrome critical region protein 2 | KIAA1740
Type:
PROTEIN
Mol. Mass.:
164223.89
Organism:
Homo sapiens (Human)
Description:
ChEMBL_107999
Residue:
1484
  
Inhibitor
Name:
BDBM50514852
Synonyms:
CHEMBL4470476
Type:
Small organic molecule
Emp. Form.:
C20H20BrN3O4S
Mol. Mass.:
478.359
SMILES:
C[C@H]1CCN(C1)S(=O)(=O)c1cc(NC(=O)Cc2noc3ccccc23)ccc1Br
: